Target
Cannabinoid receptor 1
Ligand
BDBM50401062
Substrate
Meas. Tech.
ChEMBL_882430 (CHEMBL2210669)
Ki
14±n/a nM
Citation
 Wiley, JLSmith, VJChen, JMartin, BRHuffman, JW Synthesis and pharmacology of 1-alkyl-3-(1-naphthoyl)indoles: steric and electronic effects of 4- and 8-halogenated naphthoyl substituents. Bioorg Med Chem 20:2067-81 (2012)  
Target
Name:
Cannabinoid receptor 1
Synonyms:
CANN6 CB-R CNR CNR1_HUMAN Cannabinoid receptor Cannabinoid receptor 1 (brain)
Type:
G Protein-Coupled Receptor (GPCR)
Mol. Mass.:
52868.96
Organism:
Homo sapiens (Human)
Description:
P21554
Residue:
472
  
Inhibitor
Name:
BDBM50401062
Synonyms:
CHEMBL2206835
Type:
Small organic molecule
Emp. Form.:
C25H24BrNO
Mol. Mass.:
434.368
SMILES:
CCCCCn1c(C)c(C(=O)c2ccc(Br)c3ccccc23)c2ccccc12
: