Target
Thyroid hormone receptor alpha
Ligand
BDBM50401075
Substrate
Meas. Tech.
ChEMBL_883198 (CHEMBL2212124)
EC50
18±n/a nM
Citation
 Joharapurkar, AADhote, VVJain, MR Selective thyromimetics using receptor and tissue selectivity approaches: prospects for dyslipidemia. J Med Chem 55:5649-75 (2012)  
Target
Name:
Thyroid hormone receptor alpha
Synonyms:
C-erbA-alpha EAR7 NR1A1 THA_HUMAN THRA1 Thyroid Hormone Receptor (TR-alpha) Thyroid hormone receptor alpha c-erbA-1
Type:
Receptor
Mol. Mass.:
54818.00
Organism:
Homo sapiens (Human)
Description:
Recombinant hThR was obtained from nuclear extracts from SF9 cells infected with baculovirus vectors encoding for ThRalpha 1.
Residue:
490
  
Inhibitor
Name:
BDBM50401075
Synonyms:
CHEMBL2203702
Type:
Small organic molecule
Emp. Form.:
C29H23Cl2NO5
Mol. Mass.:
536.403
SMILES:
OC(=O)Cc1cc(Cl)c(Oc2ccc(O)c(c2)C(=O)NCC(c2ccccc2)c2ccccc2)c(Cl)c1
: