Target
Serine/threonine-protein kinase B-raf
Ligand
BDBM50401285
Substrate
Meas. Tech.
ChEMBL_883084 (CHEMBL2210728)
IC50
69±n/a nM
Citation
 Hirose, MOkaniwa, MMiyazaki, TImada, TOhashi, TTanaka, YArita, TYabuki, MKawamoto, TTsutsumi, SSumita, ATakagi, TSang, BCYano, JAertgeerts, KYoshida, SIshikawa, T Design and synthesis of novel DFG-out RAF/vascular endothelial growth factor receptor 2 (VEGFR2) inhibitors: 3. Evaluation of 5-amino-linked thiazolo[5,4-d]pyrimidine and thiazolo[5,4-b]pyridine derivatives. Bioorg Med Chem 20:5600-15 (2012)  
Target
Name:
Serine/threonine-protein kinase B-raf
Synonyms:
B-RAF B-Raf proto-oncogene serine/threonine-protein kinase BRAF1 RAFB1 v-Raf murine sarcoma viral oncogene homolog B1
Type:
Serine/threonine-protein kinase
Mol. Mass.:
84446.00
Organism:
Homo sapiens (Human)
Description:
P15056
Residue:
766
  
Inhibitor
Name:
BDBM50401285
Synonyms:
CHEMBL2204532
Type:
Small organic molecule
Emp. Form.:
C28H24ClFN6O3S
Mol. Mass.:
579.045
SMILES:
CN(c1ccc(F)c(NC(=O)c2cccc(OC(C)(C)C#N)c2Cl)c1)c1ccc2nc(NC(=O)C3CC3)sc2n1
: