Target
Muscarinic acetylcholine receptor M4
Ligand
BDBM50401367
Substrate
Meas. Tech.
ChEMBL_884094 (CHEMBL2215570)
Ki
1302±n/a nM
Citation
 Banister, SDManoli, MDoddareddy, MRHibbs, DEKassiou, M As(1) receptor pharmacophore derived from a series of N-substituted 4-azahexacyclo[5.4.1.0(2,6).0(3,10).0(5,9).0(8,11)]dodecan-3-ols (AHDs). Bioorg Med Chem Lett 22:6053-8 (2012)  
Target
Name:
Muscarinic acetylcholine receptor M4
Synonyms:
ACM4_HUMAN Cholinergic, muscarinic M4 Muscarinic acetylcholine receptor M2 and M4
Type:
Enzyme Catalytic Domain
Mol. Mass.:
53079.31
Organism:
Homo sapiens (Human)
Description:
Cholinergic, muscarinic M4 CHRM4 HUMAN M3::P08173
Residue:
479
  
Inhibitor
Name:
BDBM50401367
Synonyms:
CHEMBL2205829
Type:
Small organic molecule
Emp. Form.:
C19H19NO3
Mol. Mass.:
309.3591
SMILES:
OC12C3C4C5C3C(C3C5CC4C13)N2Cc1ccc2OCOc2c1
: