Target
Amine oxidase [flavin-containing] A
Ligand
BDBM50401404
Substrate
Meas. Tech.
ChEMBL_881848 (CHEMBL2211557)
Ki
18±n/a nM
Citation
 Mattsson, CAndreasson, TWaters, NSonesson, C Systematic in vivo screening of a series of 1-propyl-4-arylpiperidines against dopaminergic and serotonergic properties in rat brain: a scaffold-jumping approach. J Med Chem 55:9735-50 (2012)  
Target
Name:
Amine oxidase [flavin-containing] A
Synonyms:
AOFA_RAT Amine oxidase [flavin-containing] A Monoamine Oxidase Type A (MAO-A) Monoamine oxidase A (MAO-A) Monoamine oxidase type A (MAOA)
Type:
Enzyme
Mol. Mass.:
59515.21
Organism:
Rattus norvegicus (rat)
Description:
Residue:
526
  
Inhibitor
Name:
BDBM50401404
Synonyms:
CHEMBL2207498
Type:
Small organic molecule
Emp. Form.:
C16H21NS
Mol. Mass.:
259.41
SMILES:
CCCN1CCC(CC1)c1cc2ccccc2s1
: