Target
Amine oxidase [flavin-containing] A
Ligand
BDBM50401405
Substrate
Meas. Tech.
ChEMBL_881848 (CHEMBL2211557)
Ki
63±n/a nM
Citation
 Mattsson, CAndreasson, TWaters, NSonesson, C Systematic in vivo screening of a series of 1-propyl-4-arylpiperidines against dopaminergic and serotonergic properties in rat brain: a scaffold-jumping approach. J Med Chem 55:9735-50 (2012)  
Target
Name:
Amine oxidase [flavin-containing] A
Synonyms:
AOFA_RAT Amine oxidase [flavin-containing] A Monoamine Oxidase Type A (MAO-A) Monoamine oxidase A (MAO-A) Monoamine oxidase type A (MAOA)
Type:
Enzyme
Mol. Mass.:
59515.21
Organism:
Rattus norvegicus (rat)
Description:
Residue:
526
  
Inhibitor
Name:
BDBM50401405
Synonyms:
CHEMBL2207497
Type:
Small organic molecule
Emp. Form.:
C18H23N
Mol. Mass.:
253.3819
SMILES:
CCCN1CCC(CC1)c1ccc2ccccc2c1
: