Target
Sodium-dependent noradrenaline transporter
Ligand
BDBM50401744
Substrate
Meas. Tech.
ChEMBL_885013 (CHEMBL2211273)
Ki
7.2±n/a nM
Citation
 Pechulis, ADBeck, JPCurry, MAWolf, MAHarms, AEXi, NOpalka, CSweet, MPYang, ZVellekoop, ASKlos, AMCrocker, PJHassler, CLaws, MKitchen, DBSmith, MAOlson, RELiu, SMolino, BF 4-Phenyl tetrahydroisoquinolines as dual norepinephrine and dopamine reuptake inhibitors. Bioorg Med Chem Lett 22:7219-22 (2012)  
Target
Name:
Sodium-dependent noradrenaline transporter
Synonyms:
Monoamine transporter NET Noradrenaline Transporter (NET) Norepinephrine transporter protein (NET) SLC6A2 Sodium-dependent noradrenaline transporter (NET) | Solute carrier family 6 member 2
Type:
Multi-pass membrane protein
Mol. Mass.:
69337.72
Organism:
Homo sapiens (Human)
Description:
P23975
Residue:
617
  
Inhibitor
Name:
BDBM50401744
Synonyms:
CHEMBL2206525
Type:
Small organic molecule
Emp. Form.:
C16H15ClFN
Mol. Mass.:
275.748
SMILES:
CN1CC(c2ccc(Cl)c(F)c2)c2ccccc2C1
: