Target
Kappa-type opioid receptor
Ligand
BDBM50402014
Substrate
Meas. Tech.
ChEMBL_886706 (CHEMBL2209606)
Ki
14.5±n/a nM
Citation
 Fujii, HImaide, SHirayama, SNemoto, TGouda, HHirono, SNagase, H Essential structure of opioid¿ receptor agonist nalfurafine for binding to the¿ receptor 3: synthesis of decahydro(iminoethano)phenanthrene derivatives with an oxygen functionality at the 3-position and their pharmacologies. Bioorg Med Chem Lett 22:7711-4 (2012)  
Target
Name:
Kappa-type opioid receptor
Synonyms:
Kappa Opioid Receptor OPRK1 Opiate Kappa 1 | mu/kappa opioid receptor
Type:
G Protein-Coupled Receptor (GPCR)
Mol. Mass.:
42744.99
Organism:
Cavia porcellus (domestic guinea pig)
Description:
P41144
Residue:
380
  
Inhibitor
Name:
BDBM50402014
Synonyms:
CHEMBL2205415
Type:
Small organic molecule
Emp. Form.:
C28H36N2O4
Mol. Mass.:
464.5964
SMILES:
CN([C@@H]1CC[C@@]2(O)[C@H]3CC4=C(CC(=O)CC4)[C@@]2(CCN3CC2CC2)C1)C(=O)\C=C\c1ccoc1
: