Target
Delta-type opioid receptor
Ligand
BDBM50402011
Substrate
Meas. Tech.
ChEMBL_886707 (CHEMBL2209607)
Ki
49.5±n/a nM
Citation
 Fujii, HImaide, SHirayama, SNemoto, TGouda, HHirono, SNagase, H Essential structure of opioid¿ receptor agonist nalfurafine for binding to the¿ receptor 3: synthesis of decahydro(iminoethano)phenanthrene derivatives with an oxygen functionality at the 3-position and their pharmacologies. Bioorg Med Chem Lett 22:7711-4 (2012)  
Target
Name:
Delta-type opioid receptor
Synonyms:
DOR-1 MSL-2 OPRD_MOUSE Oprd1
Type:
Enzyme Catalytic Domain
Mol. Mass.:
40577.25
Organism:
MOUSE
Description:
P32300
Residue:
372
  
Inhibitor
Name:
BDBM50402011
Synonyms:
CHEMBL2205418
Type:
Small organic molecule
Emp. Form.:
C28H32N2O4
Mol. Mass.:
460.5647
SMILES:
CN([C@H]1CC[C@@]2(O)[C@H]3Cc4cccc5O[C@@H]1[C@]2(CCN3CC1CC1)c45)C(=O)\C=C\c1ccoc1
: