Target
Delta-type opioid receptor
Ligand
BDBM50402017
Substrate
Meas. Tech.
ChEMBL_886707 (CHEMBL2209607)
Ki
8.66±n/a nM
Citation
 Fujii, HImaide, SHirayama, SNemoto, TGouda, HHirono, SNagase, H Essential structure of opioid¿ receptor agonist nalfurafine for binding to the¿ receptor 3: synthesis of decahydro(iminoethano)phenanthrene derivatives with an oxygen functionality at the 3-position and their pharmacologies. Bioorg Med Chem Lett 22:7711-4 (2012)  
Target
Name:
Delta-type opioid receptor
Synonyms:
DOR-1 MSL-2 OPRD_MOUSE Oprd1
Type:
Enzyme Catalytic Domain
Mol. Mass.:
40577.25
Organism:
MOUSE
Description:
P32300
Residue:
372
  
Inhibitor
Name:
BDBM50402017
Synonyms:
CHEMBL2205412
Type:
Small organic molecule
Emp. Form.:
C28H38N2O4
Mol. Mass.:
466.6123
SMILES:
CN([C@H]1CC[C@@]2(O)[C@H]3CC4=C(C[C@@H](O)CC4)[C@@]2(CCN3CC2CC2)C1)C(=O)\C=C\c1ccoc1
: