Target
Mu-type opioid receptor
Ligand
BDBM50402018
Substrate
Meas. Tech.
ChEMBL_886708 (CHEMBL2209608)
Ki
57.6±n/a nM
Citation
 Fujii, HImaide, SHirayama, SNemoto, TGouda, HHirono, SNagase, H Essential structure of opioid¿ receptor agonist nalfurafine for binding to the¿ receptor 3: synthesis of decahydro(iminoethano)phenanthrene derivatives with an oxygen functionality at the 3-position and their pharmacologies. Bioorg Med Chem Lett 22:7711-4 (2012)  
Target
Name:
Mu-type opioid receptor
Synonyms:
M-OR-1 Mor OPRM_MOUSE Oprm | Oprm1
Type:
Enzyme Catalytic Domain
Mol. Mass.:
44431.62
Organism:
MOUSE
Description:
OPIATE Mu OPRM1 MOUSE::P42866
Residue:
398
  
Inhibitor
Name:
BDBM50402018
Synonyms:
CHEMBL2204731
Type:
Small organic molecule
Emp. Form.:
C28H38N2O4
Mol. Mass.:
466.6123
SMILES:
CN([C@@H]1CC[C@@]2(O)[C@H]3CC4=C(C[C@H](O)CC4)[C@@]2(CCN3CC2CC2)C1)C(=O)\C=C\c1ccoc1
: