Target
Candidapepsin-2
Ligand
BDBM50402349
Substrate
Meas. Tech.
ChEMBL_885955 (CHEMBL2215717)
IC50
740±n/a nM
Citation
 Calugi, CTrabocchi, ADe Bernardis, FArancia, SNavarra, PCauda, RCassone, AGuarna, A Bicyclic peptidomimetics targeting secreted aspartic protease 2 (SAP2) from Candida albicans reveal a constrained inhibitory chemotype. Bioorg Med Chem 20:7206-13 (2012)  
Target
Name:
Candidapepsin-2
Synonyms:
ACP 2 CARP2_CANAX PRA2 Secreted aspartic protease 2
Type:
PROTEIN
Mol. Mass.:
42313.90
Organism:
Candida albicans
Description:
ChEMBL_885955
Residue:
398
  
Inhibitor
Name:
BDBM50402349
Synonyms:
CHEMBL2206677
Type:
Small organic molecule
Emp. Form.:
C18H28N2O6
Mol. Mass.:
368.4247
SMILES:
COC(=O)[C@@H](CC(C)C)N1C[C@H]2O[C@@H]([C@H](O2)C1=O)C(=O)N1CCCCC1
: