Target
Candidapepsin-2
Ligand
BDBM912
Substrate
Meas. Tech.
ChEMBL_885955 (CHEMBL2215717)
IC50
90±n/a nM
Citation
 Calugi, CTrabocchi, ADe Bernardis, FArancia, SNavarra, PCauda, RCassone, AGuarna, A Bicyclic peptidomimetics targeting secreted aspartic protease 2 (SAP2) from Candida albicans reveal a constrained inhibitory chemotype. Bioorg Med Chem 20:7206-13 (2012)  
Target
Name:
Candidapepsin-2
Synonyms:
ACP 2 CARP2_CANAX PRA2 Secreted aspartic protease 2
Type:
PROTEIN
Mol. Mass.:
42313.90
Organism:
Candida albicans
Description:
ChEMBL_885955
Residue:
398
  
Inhibitor
Name:
BDBM912
Synonyms:
(3S,4S)-3-hydroxy-4-[(2S)-2-[(3S,4S)-3-hydroxy-6-methyl-4-[(2S)-3-methyl-2-[(2S)-3-methyl-2-(3-methylbutanamido)butanamido]butanamido]heptanamido]propanamido]-6-methylheptanoic acid Iva-Val-Val-Sta-Ala-Sta-OH PEPSTATIN US9115083, Pepstatin
Type:
Small organic molecule
Emp. Form.:
C34H63N5O9
Mol. Mass.:
685.8921
SMILES:
CC(C)C[C@H](NC(=O)[C@H](C)NC(=O)C[C@H](O)[C@H](CC(C)C)NC(=O)[C@@H](NC(=O)[C@@H](NC(=O)CC(C)C)C(C)C)C(C)C)[C@@H](O)CC(O)=O
: