Target
Delta-type opioid receptor
Ligand
BDBM50402773
Substrate
Meas. Tech.
ChEMBL_887195 (CHEMBL2215303)
Ki
1.3±n/a nM
Citation
 Wentland, MPJo, SGargano, JMVanAlstine, MACohen, DJBidlack, JM Redefining the structure-activity relationships of 2,6-methano-3-benzazocines. Part 8. High affinity ligands for opioid receptors in the picomolar Ki range: oxygenated N-(2-[1,1'-biphenyl]-4-ylethyl) analogues of 8-CAC. Bioorg Med Chem Lett 22:7340-4 (2012)  
Target
Name:
Delta-type opioid receptor
Synonyms:
D-OR-1 Delta opioid receptor OPIATE Delta OPRD1 OPRK1 | opioid receptor, delta 1
Type:
G Protein-Coupled Receptor (GPCR)
Mol. Mass.:
40382.98
Organism:
Homo sapiens (Human)
Description:
Competition binding assays were carried out using membrane preparations from transfected HN9.10 cells that constitutively expressed the delta opioid receptor.
Residue:
372
  
Inhibitor
Name:
BDBM50402773
Synonyms:
CHEMBL2208358
Type:
Small organic molecule
Emp. Form.:
C34H40N2O2
Mol. Mass.:
508.6936
SMILES:
COc1cccc(c1)-c1ccc(CCNC(=O)c2ccc3CC4C(C)C(C)(CCN4CC4CC4)c3c2)cc1
: