Target
Carnitine O-palmitoyltransferase 2, mitochondrial
Ligand
BDBM50046145
Substrate
Meas. Tech.
ChEMBL_887451 (CHEMBL2217060)
Ki
4200±n/a nM
Citation
 Ceccarelli, SMChomienne, OGubler, MArduini, A Carnitine palmitoyltransferase (CPT) modulators: a medicinal chemistry perspective on 35 years of research. J Med Chem 54:3109-52 (2011)  
Target
Name:
Carnitine O-palmitoyltransferase 2, mitochondrial
Synonyms:
CPT II CPT2 Carnitine O-palmitoyltransferase 2, mitochondrial Carnitine palmitoyltransferase II
Type:
PROTEIN
Mol. Mass.:
73789.25
Organism:
Homo sapiens (Human)
Description:
ChEMBL_887455
Residue:
658
  
Inhibitor
Name:
BDBM50046145
Synonyms:
2-[6-hydroxy-4,4-dimethyl-6-pentadecyl-(2R,6S)-1,4-oxazinan-4-ium-2-yl]acetate(hemipalmitoylcarnitinium (HPC)) CHEMBL48257 | Hemiacylcarnitinium(+)-HPC
Type:
Small organic molecule
Emp. Form.:
C23H45NO4
Mol. Mass.:
399.6077
SMILES:
CCCCCCCCCCCCCCC[C@@]1(O)C[N+](C)(C)C[C@@H](CC([O-])=O)O1
: