Target
3-oxo-5-alpha-steroid 4-dehydrogenase 2
Ligand
BDBM50368782
Substrate
Meas. Tech.
ChEMBL_205047 (CHEMBL812406)
Ki
1000±n/a nM
Citation
 Abell, ADErhard, KFYen, HYamashita, DSBrandt, MMohammed, HLevy, MAHolt, DA Preparative chiral HPLC separation of all possible stereoisomers of LY191704 and LY266111 and their in vitro inhibition of human types 1 and 2 steroid 5-reductases Bioorg Med Chem Lett 4:1365-1368 (1994)    Article 
Target
Name:
3-oxo-5-alpha-steroid 4-dehydrogenase 2
Synonyms:
3-oxo-5-alpha-steroid 4-dehydrogenase 2 5α-Reductase 2 (5α-R2) SR type 2 Steroid 5-alpha-reductase Type II 5-alpha reductase
Type:
Enzyme
Mol. Mass.:
28406.59
Organism:
Homo sapiens (Human)
Description:
P31213
Residue:
254
  
Inhibitor
Name:
BDBM50368782
Synonyms:
Bexlosteride LY-191704
Type:
Small organic molecule
Emp. Form.:
C14H16ClNO
Mol. Mass.:
249.736
SMILES:
CN1[C@@H]2CCc3cc(Cl)ccc3[C@H]2CCC1=O
: