Target
D(2) dopamine receptor
Ligand
BDBM50215378
Substrate
Meas. Tech.
ChEMBL_60952 (CHEMBL670971)
Ki
<10000±n/a nM
Citation
 Masaguer, CFFormoso, ERaviña, ETristán, HLoza, MIRivas, EFontenla, JA Butyrophenone analogues in the carbazole series: synthesis and determination of affinities at D2 and 5-HT2A receptors. Bioorg Med Chem Lett 8:3571-6 (1999)  
Target
Name:
D(2) dopamine receptor
Synonyms:
DOPAMINE D2 DOPAMINE D2 Short Dopamine D2 receptor Drd2
Type:
G Protein-Coupled Receptor (GPCR)
Mol. Mass.:
50931.60
Organism:
Rattus norvegicus (rat)
Description:
P61169
Residue:
444
  
Inhibitor
Name:
BDBM50215378
Synonyms:
CHEMBL327038
Type:
Small organic molecule
Emp. Form.:
C17H20N2O2
Mol. Mass.:
284.3529
SMILES:
O=C1CC(CN2CCOCC2)Cc2[nH]c3ccccc3c12
: