Target
D(2) dopamine receptor
Ligand
BDBM50403683
Substrate
Meas. Tech.
ChEMBL_60952 (CHEMBL670971)
Ki
141±n/a nM
Citation
 Masaguer, CFFormoso, ERaviña, ETristán, HLoza, MIRivas, EFontenla, JA Butyrophenone analogues in the carbazole series: synthesis and determination of affinities at D2 and 5-HT2A receptors. Bioorg Med Chem Lett 8:3571-6 (1999)  
Target
Name:
D(2) dopamine receptor
Synonyms:
DOPAMINE D2 DOPAMINE D2 Short Dopamine D2 receptor Drd2
Type:
G Protein-Coupled Receptor (GPCR)
Mol. Mass.:
50931.60
Organism:
Rattus norvegicus (rat)
Description:
P61169
Residue:
444
  
Inhibitor
Name:
BDBM50403683
Synonyms:
CHEMBL333174
Type:
Small organic molecule
Emp. Form.:
C25H24FN3O2
Mol. Mass.:
417.4754
SMILES:
Fc1ccc2c(noc2c1)C1CCN(CC2Cc3[nH]c4ccccc4c3C(=O)C2)CC1
: