Target
D(2) dopamine receptor
Ligand
BDBM50403682
Substrate
Meas. Tech.
ChEMBL_60952 (CHEMBL670971)
Ki
1549±n/a nM
Citation
 Masaguer, CFFormoso, ERaviña, ETristán, HLoza, MIRivas, EFontenla, JA Butyrophenone analogues in the carbazole series: synthesis and determination of affinities at D2 and 5-HT2A receptors. Bioorg Med Chem Lett 8:3571-6 (1999)  
Target
Name:
D(2) dopamine receptor
Synonyms:
DOPAMINE D2 DOPAMINE D2 Short Dopamine D2 receptor Drd2
Type:
G Protein-Coupled Receptor (GPCR)
Mol. Mass.:
50931.60
Organism:
Rattus norvegicus (rat)
Description:
P61169
Residue:
444
  
Inhibitor
Name:
BDBM50403682
Synonyms:
CHEMBL121744
Type:
Small organic molecule
Emp. Form.:
C24H27N3O2
Mol. Mass.:
389.4901
SMILES:
COc1ccccc1N1CCN(CC2Cc3[nH]c4ccccc4c3C(=O)C2)CC1
: