Target
5-hydroxytryptamine receptor 2A
Ligand
BDBM50403682
Substrate
Meas. Tech.
ChEMBL_226359 (CHEMBL858013)
Ki
631±n/a nM
Citation
 Masaguer, CFFormoso, ERaviña, ETristán, HLoza, MIRivas, EFontenla, JA Butyrophenone analogues in the carbazole series: synthesis and determination of affinities at D2 and 5-HT2A receptors. Bioorg Med Chem Lett 8:3571-6 (1999)  
Target
Name:
5-hydroxytryptamine receptor 2A
Synonyms:
5-HT-2A 5-HT2A 5-hydroxytryptamine receptor 2A (5HT2A) Htr2 Serotonin Receptor 2A
Type:
G Protein-Coupled Receptor (GPCR)
Mol. Mass.:
52852.05
Organism:
Rattus norvegicus (rat)
Description:
Rat cortex membranes 5-HT2A receptors.
Residue:
471
  
Inhibitor
Name:
BDBM50403682
Synonyms:
CHEMBL121744
Type:
Small organic molecule
Emp. Form.:
C24H27N3O2
Mol. Mass.:
389.4901
SMILES:
COc1ccccc1N1CCN(CC2Cc3[nH]c4ccccc4c3C(=O)C2)CC1
: