Target
Alpha-2A adrenergic receptor
Ligand
BDBM50403742
Substrate
Meas. Tech.
ChEBML_33196
IC50
0.446684±n/a nM
Citation
 Kennis, LEBischoff, FPMertens, CJLove, CJVan den Keybus, FAPieters, SBraeken, MMegens, AALeysen, JE New 2-substituted 1,2,3,4-tetrahydrobenzofuro[3,2-c]pyridine having highly active and potent central alpha 2-antagonistic activity as potential antidepressants. Bioorg Med Chem Lett 10:71-4 (2000)  
Target
Name:
Alpha-2A adrenergic receptor
Synonyms:
ADA2A_HUMAN ADRA2R Adrenergic alpha2A Alpha-2 adrenergic receptor subtype C10 Alpha-2A adrenoreceptor alpha-2A adrenergic receptor [Homo sapiens]
Type:
Enzyme
Mol. Mass.:
48979.91
Organism:
Homo sapiens (Human)
Description:
P08913
Residue:
465
  
Inhibitor
Name:
BDBM50403742
Synonyms:
CHEMBL165796
Type:
Small organic molecule
Emp. Form.:
C23H23N3O2
Mol. Mass.:
373.4476
SMILES:
Cc1ccn2c(c1)nc(C)c(CCN1CCc3oc4ccccc4c3C1)c2=O
: