Target
Alpha-2C adrenergic receptor
Ligand
BDBM50403740
Substrate
Meas. Tech.
ChEBML_33659
IC50
0.691831±n/a nM
Citation
 Kennis, LEBischoff, FPMertens, CJLove, CJVan den Keybus, FAPieters, SBraeken, MMegens, AALeysen, JE New 2-substituted 1,2,3,4-tetrahydrobenzofuro[3,2-c]pyridine having highly active and potent central alpha 2-antagonistic activity as potential antidepressants. Bioorg Med Chem Lett 10:71-4 (2000)  
Target
Name:
Alpha-2C adrenergic receptor
Synonyms:
ADA2C_HUMAN ADRA2L2 Adrenergic alpha2C Adrenergic receptor alpha Alpha-2 adrenergic receptor subtype C4 Alpha-2C adrenoreceptor | adrenergic, alpha-2C-, receptor [Homo sapiens]
Type:
Enzyme
Mol. Mass.:
49552.32
Organism:
Homo sapiens (Human)
Description:
P18825
Residue:
462
  
Inhibitor
Name:
BDBM50403740
Synonyms:
CHEMBL165350
Type:
Small organic molecule
Emp. Form.:
C22H20BrN3O2
Mol. Mass.:
438.317
SMILES:
Cc1nc2ccc(Br)cn2c(=O)c1CCN1CCc2oc3ccccc3c2C1
: