Target
5-hydroxytryptamine receptor 7
Ligand
BDBM50403781
Substrate
Meas. Tech.
ChEBML_3771
Ki
<1000±n/a nM
Citation
 López-Rodríguez, MLPorras, EBenhamú, BRamos, JAMorcillo, MJLavandera, JL First pharmacophoric hypothesis for 5-HT7 antagonism. Bioorg Med Chem Lett 10:1097-100 (2000)  
Target
Name:
5-hydroxytryptamine receptor 7
Synonyms:
5-HT-7 5-HT7 5-HT7S 5-hydroxytryptamine receptor 7 5HT7R_RAT GPRFO Serotonin (5-HT) receptor | Serotonin Receptor 7
Type:
G Protein-Coupled Receptor (GPCR)
Mol. Mass.:
49852.62
Organism:
Rattus norvegicus (rat)
Description:
Rat cloned 5-HT7R.
Residue:
448
  
Inhibitor
Name:
BDBM50403781
Synonyms:
CHEMBL275495
Type:
Small organic molecule
Emp. Form.:
C21H26N2O
Mol. Mass.:
322.4439
SMILES:
CC1CCN(CCCCN2C(=O)c3cccc4cccc2c34)CC1
: