Target
5-hydroxytryptamine receptor 7
Ligand
BDBM50098550
Substrate
Meas. Tech.
ChEBML_3724
Ki
32±n/a nM
Citation
 López-Rodríguez, MLPorras, EBenhamú, BRamos, JAMorcillo, MJLavandera, JL First pharmacophoric hypothesis for 5-HT7 antagonism. Bioorg Med Chem Lett 10:1097-100 (2000)  
Target
Name:
5-hydroxytryptamine receptor 7
Synonyms:
5-HT-7 5-HT7 5-HT7S 5HT7 HTR7 | Serotonin receptor 7
Type:
G Protein-Coupled Receptor (GPCR)
Mol. Mass.:
53573.08
Organism:
Homo sapiens (Human)
Description:
P34969
Residue:
479
  
Inhibitor
Name:
BDBM50098550
Synonyms:
3,N-Dimethyl-N-[(R)-1-methyl-3-(4-methyl-piperidin-1-yl)-propyl]-benzenesulfonamide 3,N-Dimethyl-N-[1-methyl-3-(4-methyl-piperidin-1-yl)-propyl]-benzenesulfonamide (SB-258719) CHEMBL12264 | SB-258719
Type:
Small organic molecule
Emp. Form.:
C18H30N2O2S
Mol. Mass.:
338.508
SMILES:
C[C@H](CCN1CCC(C)CC1)N(C)S(=O)(=O)c1cccc(C)c1
: