Target
Integrin alpha-V/beta-3
Ligand
BDBM50108463
Substrate
Meas. Tech.
ChEMBL_32966 (CHEMBL644681)
Ki
13±n/a nM
Citation
 Urbahns, KHärter, MAlbers, MSchmidt, DStelte-Ludwig, BBrüggemeier, UVaupel, AGerdes, C Biphenyls as potent vitronectin receptor antagonists. Bioorg Med Chem Lett 12:205-8 (2001)  
Target
Name:
Integrin alpha-V/beta-3
Synonyms:
ITGAV/ITGB3 | Integrin beta-3/Vitronectin receptor alpha
Type:
Enzyme
Mol. Mass.:
Description:
Components:
This complex has 2 components.
Component 1
Name:
Integrin alpha-V
Synonyms:
ITAV_HUMAN Integrin alpha-V/alpha-5 VNRA Vitronectin receptor | Vitronectin receptor subunit alpha
Type:
PROTEIN
Mol. Mass.:
116024.92
Organism:
Homo sapiens (Human)
Description:
ChEMBL_582336
Residue:
1048
  
Component 2
Name:
Integrin beta-3
Synonyms:
CD_antigen=CD61 GPIIIa ITGB3 Platelet membrane glycoprotein IIIa
Type:
Protein
Mol. Mass.:
87038.91
Organism:
Homo sapiens (Human)
Description:
P05106
Residue:
788
  
Inhibitor
Name:
BDBM50108463
Synonyms:
(S)-2-{3'-[3-(1,3-Dihydro-benzoimidazol-2-ylidene)-ureido]-4-methoxy-biphenyl-3-sulfonylamino}-3-phenyl-propionic acid | CHEMBL62618
Type:
Small organic molecule
Emp. Form.:
C30H27N5O6S
Mol. Mass.:
585.63
SMILES:
COc1ccc(cc1S(=O)(=O)N[C@@H](Cc1ccccc1)C(O)=O)-c1cccc(NC(=O)Nc2nc3ccccc3[nH]2)c1
: