Target
Integrin alpha-V/beta-3
Ligand
BDBM50108454
Substrate
Meas. Tech.
ChEMBL_32966 (CHEMBL644681)
Ki
4±n/a nM
Citation
 Urbahns, KHärter, MAlbers, MSchmidt, DStelte-Ludwig, BBrüggemeier, UVaupel, AGerdes, C Biphenyls as potent vitronectin receptor antagonists. Bioorg Med Chem Lett 12:205-8 (2001)  
Target
Name:
Integrin alpha-V/beta-3
Synonyms:
ITGAV/ITGB3 | Integrin beta-3/Vitronectin receptor alpha
Type:
Enzyme
Mol. Mass.:
Description:
Components:
This complex has 2 components.
Component 1
Name:
Integrin alpha-V
Synonyms:
ITAV_HUMAN Integrin alpha-V/alpha-5 VNRA Vitronectin receptor | Vitronectin receptor subunit alpha
Type:
PROTEIN
Mol. Mass.:
116024.92
Organism:
Homo sapiens (Human)
Description:
ChEMBL_582336
Residue:
1048
  
Component 2
Name:
Integrin beta-3
Synonyms:
CD_antigen=CD61 GPIIIa ITGB3 Platelet membrane glycoprotein IIIa
Type:
Protein
Mol. Mass.:
87038.91
Organism:
Homo sapiens (Human)
Description:
P05106
Residue:
788
  
Inhibitor
Name:
BDBM50108454
Synonyms:
2-{3-[3'-(2-Carboxy-1-phenyl-ethylsulfamoyl)-biphenyl-3-yl]-ureido}-3H-benzoimidazol-1-ium
Type:
Small organic molecule
Emp. Form.:
C29H26N5O5S
Mol. Mass.:
556.612
SMILES:
OC(=O)CC(NS(=O)(=O)c1cccc(c1)-c1cccc(NC(=O)Nc2[nH]c3ccccc3[nH+]2)c1)c1ccccc1
: