Target
Integrin alpha-V/beta-3
Ligand
BDBM50108468
Substrate
Meas. Tech.
ChEMBL_32966 (CHEMBL644681)
Ki
60±n/a nM
Citation
 Urbahns, KHärter, MAlbers, MSchmidt, DStelte-Ludwig, BBrüggemeier, UVaupel, AGerdes, C Biphenyls as potent vitronectin receptor antagonists. Bioorg Med Chem Lett 12:205-8 (2001)  
Target
Name:
Integrin alpha-V/beta-3
Synonyms:
ITGAV/ITGB3 | Integrin beta-3/Vitronectin receptor alpha
Type:
Enzyme
Mol. Mass.:
Description:
Components:
This complex has 2 components.
Component 1
Name:
Integrin alpha-V
Synonyms:
ITAV_HUMAN Integrin alpha-V/alpha-5 VNRA Vitronectin receptor | Vitronectin receptor subunit alpha
Type:
PROTEIN
Mol. Mass.:
116024.92
Organism:
Homo sapiens (Human)
Description:
ChEMBL_582336
Residue:
1048
  
Component 2
Name:
Integrin beta-3
Synonyms:
CD_antigen=CD61 GPIIIa ITGB3 Platelet membrane glycoprotein IIIa
Type:
Protein
Mol. Mass.:
87038.91
Organism:
Homo sapiens (Human)
Description:
P05106
Residue:
788
  
Inhibitor
Name:
BDBM50108468
Synonyms:
3-{3'-[(1H-Benzoimidazol-2-ylamino)-methyl]-4-methoxy-biphenyl-3-sulfonylamino}-3-phenyl-propionic acid | CHEMBL61899
Type:
Small organic molecule
Emp. Form.:
C30H28N4O5S
Mol. Mass.:
556.632
SMILES:
COc1ccc(cc1S(=O)(=O)NC(CC(O)=O)c1ccccc1)-c1cccc(CNc2nc3ccccc3[nH]2)c1
: