Target
D(3) dopamine receptor
Ligand
BDBM50403962
Substrate
Meas. Tech.
ChEBML_62450
IC50
339±n/a nM
Citation
 Andrés, JIAlcázar, JAlonso, JMDíaz, AFernández, JGil, PIturrino, LMatesanz, EMeert, TFMegens, ASipido, VK Synthesis and structure-activity relationship of 2-(aminoalkyl)-2,3,3a,8-tetrahydrodibenzo[c,f]isoxazolo[2,3-a]azepine derivatives: a novel series of 5-HT(2A/2C) receptor antagonists. Part 1. Bioorg Med Chem Lett 12:243-8 (2001)  
Target
Name:
D(3) dopamine receptor
Synonyms:
DOPAMINE D3 DRD3_HUMAN Dopamine D3 receptor (D3) Dopamine receptor Dopamine receptor D3
Type:
Mol. Mass.:
44243.43
Organism:
Homo sapiens (Human)
Description:
Residue:
400
  
Inhibitor
Name:
BDBM50403962
Synonyms:
CHEMBL81485
Type:
Small organic molecule
Emp. Form.:
C18H20N2O
Mol. Mass.:
280.3642
SMILES:
CNCC1CC2N(O1)c1ccccc1Cc1ccccc21
: