Target
Substance-K receptor
Ligand
BDBM50404026
Substrate
Meas. Tech.
ChEMBL_209210 (CHEMBL818004)
Ki
6.3±n/a nM
Citation
 Harmat, NJGiannotti, DNannicini, RPerrotta, ECriscuoli, MPatacchini, RRenzetti, ARGiuliani, SAltamura, MMaggi, CA Insertion of 2-carboxysuccinate and tricarballylic acid fragments into cyclic-pseudopeptides: new antagonists for the human tachykinin NK-2 receptor. Bioorg Med Chem Lett 12:693-6 (2002)  
Target
Name:
Substance-K receptor
Synonyms:
NK-2 receptor NK2R NKNAR Neurokinin A receptor Neurokinin-2 (NK-2) SKR TACR2 Tachykinin receptor 2 (NK2) | hnk-3
Type:
Protein
Mol. Mass.:
44455.78
Organism:
Homo sapiens (Human)
Description:
P21452
Residue:
398
  
Inhibitor
Name:
BDBM50404026
Synonyms:
CHEMBL350596
Type:
Small organic molecule
Emp. Form.:
C43H51N7O10
Mol. Mass.:
825.9059
SMILES:
CC(=O)NC1C(NC(=O)C[C@H]2CC(=O)N[C@@H](Cc3c[nH]c4ccccc34)C(=O)N[C@H](Cc3ccccc3)C(=O)N[C@H](Cc3ccccc3)CNC2=O)OC(CO)C(O)C1O
: