Target
Substance-K receptor
Ligand
BDBM50404023
Substrate
Meas. Tech.
ChEMBL_209210 (CHEMBL818004)
Ki
1.6±n/a nM
Citation
 Harmat, NJGiannotti, DNannicini, RPerrotta, ECriscuoli, MPatacchini, RRenzetti, ARGiuliani, SAltamura, MMaggi, CA Insertion of 2-carboxysuccinate and tricarballylic acid fragments into cyclic-pseudopeptides: new antagonists for the human tachykinin NK-2 receptor. Bioorg Med Chem Lett 12:693-6 (2002)  
Target
Name:
Substance-K receptor
Synonyms:
NK-2 receptor NK2R NKNAR Neurokinin A receptor Neurokinin-2 (NK-2) SKR TACR2 Tachykinin receptor 2 (NK2) | hnk-3
Type:
Protein
Mol. Mass.:
44455.78
Organism:
Homo sapiens (Human)
Description:
P21452
Residue:
398
  
Inhibitor
Name:
BDBM50404023
Synonyms:
CHEMBL159449
Type:
Small organic molecule
Emp. Form.:
C45H55N7O5
Mol. Mass.:
773.9621
SMILES:
O=C(C[C@@H]1CC(=O)N[C@@H](Cc2c[nH]c3ccccc23)C(=O)N[C@H](Cc2ccccc2)C(=O)N[C@H](Cc2ccccc2)CNC1=O)N1CCC(CC1)N1CCCCC1
: