Target
Alkaline phosphatase, germ cell type
Ligand
BDBM14363
Substrate
Meas. Tech.
ChEMBL_29964 (CHEMBL640398)
IC50
6250000±n/a nM
Citation
 Schwender, CFSunday, BRDecker, VL Alkaline phosphatase inhibition by a series of pyrido[2,1-b]quinazolines: A possible relationship with cromolyn-like antiallergy activity. J Med Chem 25:742-5 (1982)  
Target
Name:
Alkaline phosphatase, germ cell type
Synonyms:
ALPG ALPPL2 PPBN_HUMAN | placental-like alkaline phosphatase preproprotein
Type:
PROTEIN
Mol. Mass.:
57374.31
Organism:
Homo sapiens (Human)
Description:
ChEMBL_29964
Residue:
532
  
Inhibitor
Name:
BDBM14363
Synonyms:
3-(2-propoxyphenyl)-2,4,7,8,9-pentazabicyclo[4.3.0]nona-1,3,6-trien-5-one Tocris-0947 | Zaprinast
Type:
Small organic molecule
Emp. Form.:
C13H13N5O2
Mol. Mass.:
271.2746
SMILES:
CCCOc1ccccc1-c1nc2nn[nH]c2c(=O)[nH]1
: