Target
Alkaline phosphatase, tissue-nonspecific isozyme
Ligand
BDBM14363
Substrate
Meas. Tech.
ChEMBL_29968 (CHEMBL642161)
IC50
1750000±n/a nM
Citation
 Schwender, CFSunday, BRDecker, VL Alkaline phosphatase inhibition by a series of pyrido[2,1-b]quinazolines: A possible relationship with cromolyn-like antiallergy activity. J Med Chem 25:742-5 (1982)  
Target
Name:
Alkaline phosphatase, tissue-nonspecific isozyme
Synonyms:
Alkaline phosphatase tissue-nonspecific PPBT_RAT
Type:
PROTEIN
Mol. Mass.:
57663.75
Organism:
Rattus norvegicus
Description:
ChEMBL_29968
Residue:
524
  
Inhibitor
Name:
BDBM14363
Synonyms:
3-(2-propoxyphenyl)-2,4,7,8,9-pentazabicyclo[4.3.0]nona-1,3,6-trien-5-one Tocris-0947 | Zaprinast
Type:
Small organic molecule
Emp. Form.:
C13H13N5O2
Mol. Mass.:
271.2746
SMILES:
CCCOc1ccccc1-c1nc2nn[nH]c2c(=O)[nH]1
: