Target
Dihydrofolate reductase
Ligand
BDBM50291789
Substrate
Meas. Tech.
ChEMBL_53616 (CHEMBL661845)
Ki
66±n/a nM
Citation
 Hansch, CHathaway, BAGuo, ZRSelassie, CDDietrich, SWBlaney, JMLangridge, RVolz, KWKaufman, BT Crystallography, quantitative structure-activity relationships, and molecular graphics in a comparative analysis of the inhibition of dihydrofolate reductase from chicken liver and Lactobacillus casei by 4,6-diamino-1,2-dihydro-2,2-dimethyl-1-(substituted-phenyl)-s-triazine s. J Med Chem 27:129-43 (1984)  
Target
Name:
Dihydrofolate reductase
Synonyms:
1.5.1.3 DYR_CHICK
Type:
Mol. Mass.:
21652.69
Organism:
Gallus gallus (Chicken)
Description:
Residue:
189
  
Inhibitor
Name:
BDBM50291789
Synonyms:
1-[3-(3-Chloro-phenoxymethyl)-phenyl]-6,6-dimethyl-1,6-dihydro-[1,3,5]triazine-2,4-diamine xv1-[3-(3-Chloro-phenoxymethyl)-phenyl]-6,6-dimethyl-1,6-dihydro-[1,3,5]triazine-2,4-diamine
Type:
Small organic molecule
Emp. Form.:
C18H20ClN5O
Mol. Mass.:
357.837
SMILES:
CC1(C)N=C(N)N=C(N)N1c1cccc(COc2cccc(Cl)c2)c1
: