Target
CAD protein
Ligand
BDBM50405110
Substrate
Meas. Tech.
ChEMBL_52883 (CHEMBL663685)
pH
7.37±n/a
IC50
180000±n/a nM
Comments
extracted
Citation
 Levenson, CHMeyer, RB Design and synthesis of tetrahedral intermediate analogues as potential dihydroorotase inhibitors. J Med Chem 27:228-32 (1984)  
Target
Name:
CAD protein
Synonyms:
Cad PYR1_MOUSE
Type:
PROTEIN
Mol. Mass.:
243231.07
Organism:
Mus musculus
Description:
ChEMBL_52883
Residue:
2225
  
Inhibitor
Name:
BDBM50405110
Synonyms:
CHEMBL306140
Type:
Small organic molecule
Emp. Form.:
C5H7NO4S
Mol. Mass.:
177.178
SMILES:
OC(=O)C1CS(=O)CC(=O)N1
: