Target
CAD protein
Ligand
BDBM50405112
Substrate
Meas. Tech.
ChEMBL_52883 (CHEMBL663685)
pH
7.37±n/a
IC50
>1000000±n/a nM
Comments
extracted
Citation
 Levenson, CHMeyer, RB Design and synthesis of tetrahedral intermediate analogues as potential dihydroorotase inhibitors. J Med Chem 27:228-32 (1984)  
Target
Name:
CAD protein
Synonyms:
Cad PYR1_MOUSE
Type:
PROTEIN
Mol. Mass.:
243231.07
Organism:
Mus musculus
Description:
ChEMBL_52883
Residue:
2225
  
Inhibitor
Name:
BDBM50405112
Synonyms:
CHEMBL308628
Type:
Small organic molecule
Emp. Form.:
C4H9N2O6P
Mol. Mass.:
212.0978
SMILES:
NC(=O)NC(CP(O)(O)=O)C(O)=O
: