Target
Sulfotransferase
Ligand
BDBM50405380
Substrate
Meas. Tech.
ChEBML_67848
Ki
2430±n/a nM
Citation
 Horwitz, JPIyer, VKVardhan, HBCorombos, JBrooks, SC In vitro inhibition of estrogen sulfoconjugation by some 2- and 4-substituted estra-1,3,5(10)-trien-17 beta-ols1a. J Med Chem 29:692-8 (1986)  
Target
Name:
Sulfotransferase
Synonyms:
Estrogen sulfotransferase
Type:
PROTEIN
Mol. Mass.:
34942.30
Organism:
Sus scrofa
Description:
ChEMBL_67848
Residue:
295
  
Inhibitor
Name:
BDBM50405380
Synonyms:
CHEMBL1627565
Type:
Small organic molecule
Emp. Form.:
C18H23NO3
Mol. Mass.:
301.3801
SMILES:
C[C@]12CC[C@H]3[C@@H](CCc4c3cccc4[N+]([O-])=O)[C@@H]1CC[C@@H]2O
: