Target
Dihydrofolate reductase
Ligand
BDBM50138698
Substrate
Meas. Tech.
ChEBML_54926
Ki
4169±n/a nM
Citation
 Selassie, CDFang, ZXLi, RLHansch, CDebnath, GKlein, TELangridge, RKaufman, BT On the structure selectivity problem in drug design. A comparative study of benzylpyrimidine inhibition of vertebrate and bacterial dihydrofolate reductase via molecular graphics and quantitative structure-activity relationships. J Med Chem 32:1895-905 (1989)  
Target
Name:
Dihydrofolate reductase
Synonyms:
DYR_LACCA folA
Type:
PROTEIN
Mol. Mass.:
18437.08
Organism:
Lactobacillus casei
Description:
ChEMBL_1357878
Residue:
163
  
Inhibitor
Name:
BDBM50138698
Synonyms:
5-(4-Heptyloxy-benzyl)-pyrimidine-2,4-diamine | CHEMBL30937
Type:
Small organic molecule
Emp. Form.:
C18H26N4O
Mol. Mass.:
314.4252
SMILES:
CCCCCCCOc1ccc(Cc2cnc(N)nc2N)cc1
: