Target
Dopamine beta-hydroxylase
Ligand
BDBM50025804
Substrate
Meas. Tech.
ChEBML_59425
IC50
48978±n/a nM
Citation
 Burke, BJHopfinger, AJ 1-(substituted-benzyl)imidazole-2(3H)-thione inhibitors of dopamine beta-hydroxylase. J Med Chem 33:274-81 (1990)  
Target
Name:
Dopamine beta-hydroxylase
Synonyms:
DOPO_RAT | Dbh
Type:
PROTEIN
Mol. Mass.:
69869.10
Organism:
Rattus norvegicus
Description:
ChEMBL_59425
Residue:
620
  
Inhibitor
Name:
BDBM50025804
Synonyms:
1-(4-Hydroxy-3-methyl-benzyl)-1,3-dihydro-imidazole-2-thione | CHEMBL63767
Type:
Small organic molecule
Emp. Form.:
C11H12N2OS
Mol. Mass.:
220.291
SMILES:
Cc1cc(Cn2cc[nH]c2=S)ccc1O
: