Target
Neutrophil elastase
Ligand
BDBM50406208
Substrate
Meas. Tech.
ChEMBL_21101 (CHEMBL633695)
Ki
6.31E0±n/a nM
KOFF
1.514E-5 s-1
KON
2.57E3 M-1s-1
Citation
 Krantz, ASpencer, RWTam, TFLiak, TJCopp, LJThomas, EMRafferty, SP Design and synthesis of 4H-3,1-benzoxazin-4-ones as potent alternate substrate inhibitors of human leukocyte elastase. J Med Chem 33:464-79 (1990)  
Target
Name:
Neutrophil elastase
Synonyms:
Bone marrow serine protease Coagulation factor X ELANE Elastase HLE Leukocyte elastase Medullasin Neutrophil elastase (HNE) PMN elastase Trypsin
Type:
Enzyme
Mol. Mass.:
28532.38
Organism:
Homo sapiens (Human)
Description:
P08246
Residue:
267
  
Inhibitor
Name:
BDBM50406208
Synonyms:
CHEMBL146004
Type:
Small organic molecule
Emp. Form.:
C13H16N2O2
Mol. Mass.:
232.2783
SMILES:
CC(C)Nc1nc2cc(C)cc(C)c2c(=O)o1
: