Target
Epidermal growth factor receptor
Ligand
BDBM7460
Substrate
Meas. Tech.
ChEMBL_66885 (CHEMBL676234)
IC50
190000±n/a nM
Citation
 Stevens, MFMcCall, CJLelieveld, PAlexander, PRichter, ADavies, DE Structural studies on bioactive compounds. 23. Synthesis of polyhydroxylated 2-phenylbenzothiazoles and a comparison of their cytotoxicities and pharmacological properties with genistein and quercetin. J Med Chem 37:1689-95 (1994)  
Target
Name:
Epidermal growth factor receptor
Synonyms:
EGF Receptor Substrate EGFR_HUMAN ERBB1 Epidermal Growth Factor Receptor erbB-1 Epidermal growth factor receptor (EGFR) HER1 Proto-oncogene c-ErbB-1 Tyrosine-Protein Kinase ErbB-1
Type:
Receptor Kinase Domain
Mol. Mass.:
134279.59
Organism:
Homo sapiens (Human)
Description:
P00533
Residue:
1210
  
Inhibitor
Name:
BDBM7460
Synonyms:
2-(3,4-dihydroxyphenyl)-3,5,7-trihydroxy-4H-chromen-4-one 2-(3,4-dihydroxyphenyl)-3,5,7-trihydroxy-chromone;hydrate Quercetin Quercetin (21) US11021454, Compound Quercetin med.21724, Compound 4
Type:
Small organic molecule
Emp. Form.:
C15H10O7
Mol. Mass.:
302.2357
SMILES:
Oc1cc(O)c2c(c1)oc(-c1ccc(O)c(O)c1)c(O)c2=O
: