Target
3-oxo-5-alpha-steroid 4-dehydrogenase 2
Ligand
BDBM50407320
Substrate
Meas. Tech.
ChEMBL_204747 (CHEMBL805440)
Ki
35±n/a nM
Citation
 Holt, DAYamashita, DSKonialian-Beck, ALLuengo, JIAbell, ADBergsma, DJBrandt, MLevy, MA Benzophenone- and indolecarboxylic acids: potent type-2 specific inhibitors of human steroid 5 alpha-reductase. J Med Chem 38:13-5 (1995)  
Target
Name:
3-oxo-5-alpha-steroid 4-dehydrogenase 2
Synonyms:
3-oxo-5-alpha-steroid 4-dehydrogenase 2 5α-Reductase 2 (5α-R2) SR type 2 Steroid 5-alpha-reductase Type II 5-alpha reductase
Type:
Enzyme
Mol. Mass.:
28406.59
Organism:
Homo sapiens (Human)
Description:
P31213
Residue:
254
  
Inhibitor
Name:
BDBM50407320
Synonyms:
CHEMBL35884
Type:
Small organic molecule
Emp. Form.:
C20H16O3
Mol. Mass.:
304.3392
SMILES:
OC(=O)c1ccc(Cc2ccc(Oc3ccccc3)cc2)cc1
: