Target
Dopamine beta-hydroxylase
Ligand
BDBM50025804
Substrate
Meas. Tech.
ChEMBL_59302 (CHEMBL669437)
IC50
48977.88±n/a nM
Citation
 Hahn, MRogers, D Receptor surface models. 2. Application to quantitative structure-activity relationships studies. J Med Chem 38:2091-102 (1995)  
Target
Name:
Dopamine beta-hydroxylase
Synonyms:
DBH Dopamine beta-monooxygenase | Soluble dopamine beta-hydroxylase
Type:
PROTEIN
Mol. Mass.:
69062.68
Organism:
Homo sapiens (Human)
Description:
ChEMBL_59428
Residue:
617
  
Inhibitor
Name:
BDBM50025804
Synonyms:
1-(4-Hydroxy-3-methyl-benzyl)-1,3-dihydro-imidazole-2-thione | CHEMBL63767
Type:
Small organic molecule
Emp. Form.:
C11H12N2OS
Mol. Mass.:
220.291
SMILES:
Cc1cc(Cn2cc[nH]c2=S)ccc1O
: