Target
5-hydroxytryptamine receptor 2A
Ligand
BDBM50407851
Substrate
Meas. Tech.
ChEMBL_2558 (CHEMBL875910)
Ki
2.95±n/a nM
Citation
 Audia, JEEvrard, DAMurdoch, GRDroste, JJNissen, JSSchenck, KWFludzinski, PLucaites, VLNelson, DLCohen, ML Potent, selective tetrahydro-beta-carboline antagonists of the serotonin 2B (5HT2B) contractile receptor in the rat stomach fundus. J Med Chem 39:2773-80 (1996)  
Target
Name:
5-hydroxytryptamine receptor 2A
Synonyms:
5-HT-2A 5-HT2A 5-hydroxytryptamine receptor 2A (5HT2A) Htr2 Serotonin Receptor 2A
Type:
G Protein-Coupled Receptor (GPCR)
Mol. Mass.:
52852.05
Organism:
Rattus norvegicus (rat)
Description:
Rat cortex membranes 5-HT2A receptors.
Residue:
471
  
Inhibitor
Name:
BDBM50407851
Synonyms:
CHEMBL319009
Type:
Small organic molecule
Emp. Form.:
C21H23BrN2O2
Mol. Mass.:
415.324
SMILES:
COc1ccc(CC2NCCc3c2[nH]c2c(Br)c(C)ccc32)cc1OC
: