Target
5-hydroxytryptamine receptor 2A
Ligand
BDBM50407854
Substrate
Meas. Tech.
ChEMBL_2558 (CHEMBL875910)
Ki
2.69±n/a nM
Citation
 Audia, JEEvrard, DAMurdoch, GRDroste, JJNissen, JSSchenck, KWFludzinski, PLucaites, VLNelson, DLCohen, ML Potent, selective tetrahydro-beta-carboline antagonists of the serotonin 2B (5HT2B) contractile receptor in the rat stomach fundus. J Med Chem 39:2773-80 (1996)  
Target
Name:
5-hydroxytryptamine receptor 2A
Synonyms:
5-HT-2A 5-HT2A 5-hydroxytryptamine receptor 2A (5HT2A) Htr2 Serotonin Receptor 2A
Type:
G Protein-Coupled Receptor (GPCR)
Mol. Mass.:
52852.05
Organism:
Rattus norvegicus (rat)
Description:
Rat cortex membranes 5-HT2A receptors.
Residue:
471
  
Inhibitor
Name:
BDBM50407854
Synonyms:
CHEMBL96485
Type:
Small organic molecule
Emp. Form.:
C23H23FN2
Mol. Mass.:
346.4405
SMILES:
Cc1ccc2NC3C(CCNC3Cc3cccc4ccccc34)c2c1F
: