Target
Translocator protein
Ligand
BDBM50408039
Substrate
Meas. Tech.
ChEMBL_38119 (CHEMBL650074)
IC50
20400000±n/a nM
Citation
 So, SSKarplus, M Genetic neural networks for quantitative structure-activity relationships: improvements and application of benzodiazepine affinity for benzodiazepine/GABAA receptors. J Med Chem 39:5246-56 (1997)  
Target
Name:
Translocator protein
Synonyms:
BZRP Mitochondrial benzodiazepine receptor PKBS Peripheral-type benzodiazepine receptor TSPO_HUMAN
Type:
Enzyme
Mol. Mass.:
18834.74
Organism:
Homo sapiens (Human)
Description:
P30536
Residue:
169
  
Inhibitor
Name:
BDBM50408039
Synonyms:
CHEMBL150925 | Ro-06-7263
Type:
Small organic molecule
Emp. Form.:
C16H12Cl2N2O
Mol. Mass.:
319.185
SMILES:
CC1N=C(c2ccccc2)c2cc(Cl)ccc2N(Cl)C1=O
: