Target
5-hydroxytryptamine receptor 2C
Ligand
BDBM50408175
Substrate
Meas. Tech.
ChEMBL_2784 (CHEMBL617854)
IC50
>100000±n/a nM
Citation
 Prunier, HRault, SLancelot, JCRobba, MRenard, PDelagrange, PPfeiffer, BCaignard, DHMisslin, RGuardiola-Lemaitre, BHamon, M Novel and selective partial agonists of 5-HT3 receptors. 2. Synthesis and biological evaluation of piperazinopyridopyrrolopyrazines, piperazinopyrroloquinoxalines, and piperazinopyridopyrroloquinoxalines. J Med Chem 40:1808-19 (1997)  
Target
Name:
5-hydroxytryptamine receptor 2C
Synonyms:
5-HT-2C 5-HT2C-INI 5-HTR2C 5-hydroxytryptamine receptor 2C (5-HT-2C) 5HT-1C HTR1C Serotonin (5-HT3) receptor Serotonin Receptor 2C
Type:
G Protein-Coupled Receptor (GPCR)
Mol. Mass.:
51836.79
Organism:
Homo sapiens (Human)
Description:
P28335
Residue:
458
  
Inhibitor
Name:
BDBM50408175
Synonyms:
CHEMBL410531
Type:
Small organic molecule
Emp. Form.:
C22H20ClFN4
Mol. Mass.:
394.872
SMILES:
Fc1ccc(CN2CCN(CC2)c2nc3cc(Cl)ccc3n3cccc23)cc1
: