Target
Acetylcholinesterase
Ligand
BDBM50014109
Substrate
Meas. Tech.
ChEMBL_29849 (CHEMBL641238)
IC50
109.9±n/a nM
Citation
 So, SSKarplus, M Three-dimensional quantitative structure-activity relationships from molecular similarity matrices and genetic neural networks. 2. Applications. J Med Chem 40:4360-71 (1998)  
Target
Name:
Acetylcholinesterase
Synonyms:
ACES_HUMAN Acetylcholinesterase (AChE) | Acetylcholinesterase (human AChE)
Type:
Enzyme
Mol. Mass.:
67792.70
Organism:
Homo sapiens (Human)
Description:
P22303
Residue:
614
  
Inhibitor
Name:
BDBM50014109
Synonyms:
(-)-Octyl-carbamic acid 1,3a,8-trimethyl-1,2,3,3a,8,8a-hexahydro-pyrrolo[2,3-b]indol-5-yl ester | CHEMBL74107
Type:
Small organic molecule
Emp. Form.:
C22H35N3O2
Mol. Mass.:
373.5322
SMILES:
CCCCCCCCNC(=O)Oc1ccc2N(C)[C@H]3N(C)CC[C@@]3(C)c2c1
: