Target
Dopamine beta-hydroxylase
Ligand
BDBM50025806
Substrate
Meas. Tech.
ChEMBL_59428 (CHEMBL671831)
IC50
1995.26±n/a nM
Citation
 So, SSKarplus, M Three-dimensional quantitative structure-activity relationships from molecular similarity matrices and genetic neural networks. 2. Applications. J Med Chem 40:4360-71 (1998)  
Target
Name:
Dopamine beta-hydroxylase
Synonyms:
DBH Dopamine beta-monooxygenase | Soluble dopamine beta-hydroxylase
Type:
PROTEIN
Mol. Mass.:
69062.68
Organism:
Homo sapiens (Human)
Description:
ChEMBL_59428
Residue:
617
  
Inhibitor
Name:
BDBM50025806
Synonyms:
1-(3-Chloro-4-hydroxy-benzyl)-1,3-dihydro-imidazole-2-thione | CHEMBL67235
Type:
Small organic molecule
Emp. Form.:
C10H9ClN2OS
Mol. Mass.:
240.709
SMILES:
Oc1ccc(Cn2cc[nH]c2=S)cc1Cl
: