Target
Acetylcholinesterase
Ligand
BDBM50055167
Substrate
Meas. Tech.
ChEMBL_29849 (CHEMBL641238)
IC50
8128305.16±n/a nM
Citation
 So, SSKarplus, M Three-dimensional quantitative structure-activity relationships from molecular similarity matrices and genetic neural networks. 2. Applications. J Med Chem 40:4360-71 (1998)  
Target
Name:
Acetylcholinesterase
Synonyms:
ACES_HUMAN Acetylcholinesterase (AChE) | Acetylcholinesterase (human AChE)
Type:
Enzyme
Mol. Mass.:
67792.70
Organism:
Homo sapiens (Human)
Description:
P22303
Residue:
614
  
Inhibitor
Name:
BDBM50055167
Synonyms:
(S)-2-(4-Chloro-phenyl)-2-hydroxy-4,4-dimethyl-morpholin-4-ium; bromide CHEMBL335439
Type:
Small organic molecule
Emp. Form.:
C12H17ClNO2
Mol. Mass.:
242.721
SMILES:
C[N+]1(C)CCO[C@](O)(C1)c1ccc(Cl)cc1
: