Target
Acetylcholinesterase
Ligand
BDBM50055176
Substrate
Meas. Tech.
ChEMBL_29849 (CHEMBL641238)
IC50
597035.29±n/a nM
Citation
 So, SSKarplus, M Three-dimensional quantitative structure-activity relationships from molecular similarity matrices and genetic neural networks. 2. Applications. J Med Chem 40:4360-71 (1998)  
Target
Name:
Acetylcholinesterase
Synonyms:
ACES_HUMAN Acetylcholinesterase (AChE) | Acetylcholinesterase (human AChE)
Type:
Enzyme
Mol. Mass.:
67792.70
Organism:
Homo sapiens (Human)
Description:
P22303
Residue:
614
  
Inhibitor
Name:
BDBM50055176
Synonyms:
(4-Bromo-butyl)-trimethyl-ammonium; bromide CHEMBL357451
Type:
Small organic molecule
Emp. Form.:
C7H17BrN
Mol. Mass.:
195.12
SMILES:
C[N+](C)(C)CCCCBr
: